{"text_format":"2","workbook":"xlsx","n_sheets":2,"sheets":["Sheet1","Sheet2"],"not_rendered":{"charts":0,"images":0,"macros":0,"external_links":10,"defined_names":25,"comments":1,"pivot_tables":0},"unopened":[],"bounds":{"document_bytes":16777216,"sheet_cells":100000,"run_cost":"one","rows_first":2000,"rows_last":500,"rows_between":2000,"halvings":0,"cell_chars":16384,"cell_head_chars":4096},"cells_cut":0,"cells_raw":0,"read":"whole","date_system":"1900"}

{"sheet":"Sheet1","index":0,"n_rows":231,"n_cols":26,"rows_kept":231,"cut":false,"hidden":false,"merged":[[0,0,0,20],[1,0,1,20],[2,0,2,12],[2,13,2,20],[2,21,2,23],[2,24,2,25]]}
["2024年重要岗位轮岗情况明细表"]
["备注：请认真阅读表头批注，按批注说明填写表格。"]
["轮岗实施方案（计划）",{"$nulls":12},"轮岗执行情况",{"$nulls":7},"立查立改                           ",null,null,"自查自纠                           "]
["序号","总行部门/一级分行   （按照下拉框选择）","员工工号","姓名","具体单位机构号","所在单位具体名称\n（录入机构号自动映射）","对应机构层次                       (按照下拉框选择）","当前职位","对应重要岗位(按照下拉框选择-对应2022年清单）","对应总行条线  （自动映射）","从事相应重要岗位时间\n格式：年/月/日","轮岗周期要求（年）","轮岗截止日期\n（自动计算）","对应轮岗方式(按照下拉框选择）","轮岗后单位机构号","轮岗后单位具体名称\n(录入机构号自动映射）","轮岗后职位","如有：轮岗后对应重要岗位(按照下拉框选择-对应2022年清单）","轮岗后对应总行条线   （自动映射）","轮岗执行时间\n格式：年/月/日","备注","立查立改                       (是/否）        ","是否问责","事实确认书编号  (按照下拉框选择） ","自查自纠           (是/否） ","计划轮岗日期"]
[{"$nulls":15},{"$f":"IF(O5=\"\",\"\",INDIRECT(ADDRESS(MATCH(O5,#REF!,0),4,1,TRUE,\"机构\")))","v":""},null,null,{"$f":"IFERROR(VLOOKUP(R5,#REF!,2,0),\"\")","v":""}]
[]
[{"$nulls":15},{"$f":"IF(O7=\"\",\"\",INDIRECT(ADDRESS(MATCH(O7,[5]机构!$C:$C,0),4,1,TRUE,\"机构\")))","v":""},null,null,{"$f":"IFERROR(VLOOKUP(R7,[5]全行重要岗位清单!$H$4:$I$47,2,0),\"\")","v":""}]
[{"$nulls":15},{"$f":"IF(O8=\"\",\"\",INDIRECT(ADDRESS(MATCH(O8,[5]机构!$C:$C,0),4,1,TRUE,\"机构\")))","v":""},null,null,{"$f":"IFERROR(VLOOKUP(R8,[5]全行重要岗位清单!$H$4:$I$47,2,0),\"\")","v":""}]
[{"$nulls":15},{"$f":"IF(O9=\"\",\"\",INDIRECT(ADDRESS(MATCH(O9,[6]机构!$C:$C,0),4,1,TRUE,\"机构\")))","v":""},null,null,{"$f":"IFERROR(VLOOKUP(R9,[6]全行重要岗位清单!$H$4:$I$47,2,0),\"\")","v":""}]
[{"$nulls":15},{"$f":"IF(O10=\"\",\"\",INDIRECT(ADDRESS(MATCH(O10,[6]机构!$C:$C,0),4,1,TRUE,\"机构\")))","v":""},null,null,{"$f":"IFERROR(VLOOKUP(R10,[6]全行重要岗位清单!$H$4:$I$47,2,0),\"\")","v":""}]
[{"$nulls":15},{"$f":"IF(O11=\"\",\"\",INDIRECT(ADDRESS(MATCH(O11,[6]机构!$C:$C,0),4,1,TRUE,\"机构\")))","v":""},null,null,{"$f":"IFERROR(VLOOKUP(R11,[6]全行重要岗位清单!$H$4:$I$47,2,0),\"\")","v":""}]
[{"$nulls":15},{"$f":"IF(O12=\"\",\"\",INDIRECT(ADDRESS(MATCH(O12,[6]机构!$C:$C,0),4,1,TRUE,\"机构\")))","v":""},null,null,{"$f":"IFERROR(VLOOKUP(R12,[6]全行重要岗位清单!$H$4:$I$47,2,0),\"\")","v":""}]
[{"$nulls":15},{"$f":"IF(O13=\"\",\"\",INDIRECT(ADDRESS(MATCH(O13,[7]机构!$C:$C,0),4,1,TRUE,\"机构\")))","v":""}]
[{"$nulls":15},{"$f":"IF(O14=\"\",\"\",INDIRECT(ADDRESS(MATCH(O14,[7]机构!$C:$C,0),4,1,TRUE,\"机构\")))","v":""},null,null,{"$f":"IFERROR(VLOOKUP(R14,[7]全行重要岗位清单!$H$4:$I$47,2,0),\"\")","v":""}]
[{"$nulls":15},{"$f":"IF(O15=\"\",\"\",INDIRECT(ADDRESS(MATCH(O15,[7]机构!$C:$C,0),4,1,TRUE,\"机构\")))","v":""},null,null,{"$f":"IFERROR(VLOOKUP(R15,[7]全行重要岗位清单!$H$4:$I$47,2,0),\"\")","v":""}]
[{"$nulls":15},{"$f":"IF(O16=\"\",\"\",INDIRECT(ADDRESS(MATCH(O16,[7]机构!$C:$C,0),4,1,TRUE,\"机构\")))","v":""},null,null,{"$f":"IFERROR(VLOOKUP(R16,[7]全行重要岗位清单!$H$4:$I$47,2,0),\"\")","v":""}]
[{"$nulls":15},{"$f":"IF(O17=\"\",\"\",INDIRECT(ADDRESS(MATCH(O17,[7]机构!$C:$C,0),4,1,TRUE,\"机构\")))","v":""},null,null,{"$f":"IFERROR(VLOOKUP(R17,[7]全行重要岗位清单!$H$4:$I$47,2,0),\"\")","v":""}]
[{"$nulls":15},{"$f":"IF(O18=\"\",\"\",INDIRECT(ADDRESS(MATCH(O18,[7]机构!$C:$C,0),4,1,TRUE,\"机构\")))","v":""},null,null,{"$f":"IFERROR(VLOOKUP(R18,[7]全行重要岗位清单!$H$4:$I$47,2,0),\"\")","v":""}]
[{"$nulls":15},{"$f":"IF(O19=\"\",\"\",INDIRECT(ADDRESS(MATCH(O19,[7]机构!$C:$C,0),4,1,TRUE,\"机构\")))","v":""},null,null,{"$f":"IFERROR(VLOOKUP(R19,[7]全行重要岗位清单!$H$4:$I$47,2,0),\"\")","v":""}]
[{"$nulls":15},{"$f":"IF(O20=\"\",\"\",INDIRECT(ADDRESS(MATCH(O20,[7]机构!$C:$C,0),4,1,TRUE,\"机构\")))","v":""},null,null,{"$f":"IFERROR(VLOOKUP(R20,[7]全行重要岗位清单!$H$4:$I$47,2,0),\"\")","v":""}]
[]
[]
[]
[{"$nulls":15},{"$f":"IF(O24=\"\",\"\",INDIRECT(ADDRESS(MATCH(O24,#REF!,0),4,1,TRUE,\"机构\")))","v":""},null,null,{"$f":"IFERROR(VLOOKUP(R24,#REF!,2,0),\"\")","v":""}]
[{"$nulls":15},{"$f":"IF(O25=\"\",\"\",INDIRECT(ADDRESS(MATCH(O25,#REF!,0),4,1,TRUE,\"机构\")))","v":""},null,null,{"$f":"IFERROR(VLOOKUP(R25,#REF!,2,0),\"\")","v":""}]
[{"$nulls":15},{"$f":"IF(O26=\"\",\"\",INDIRECT(ADDRESS(MATCH(O26,#REF!,0),4,1,TRUE,\"机构\")))","v":""},null,null,{"$f":"IFERROR(VLOOKUP(R26,#REF!,2,0),\"\")","v":""}]
[{"$nulls":15},{"$f":"IF(O27=\"\",\"\",INDIRECT(ADDRESS(MATCH(O27,#REF!,0),4,1,TRUE,\"机构\")))","v":""},null,null,{"$f":"IFERROR(VLOOKUP(R27,#REF!,2,0),\"\")","v":""}]
[{"$nulls":15},{"$f":"IF(O28=\"\",\"\",INDIRECT(ADDRESS(MATCH(O28,[10]机构!$C:$C,0),4,1,TRUE,\"机构\")))","v":""},null,null,{"$f":"IFERROR(VLOOKUP(R28,[10]全行重要岗位清单!$H$4:$I$47,2,0),\"\")","v":""}]
[{"$nulls":15},{"$f":"IF(O29=\"\",\"\",INDIRECT(ADDRESS(MATCH(O29,[10]机构!$C:$C,0),4,1,TRUE,\"机构\")))","v":""},null,null,{"$f":"IFERROR(VLOOKUP(R29,[10]全行重要岗位清单!$H$4:$I$47,2,0),\"\")","v":""}]
[{"$nulls":15},{"$f":"IF(O30=\"\",\"\",INDIRECT(ADDRESS(MATCH(O30,[10]机构!$C:$C,0),4,1,TRUE,\"机构\")))","v":""},null,null,{"$f":"IFERROR(VLOOKUP(R30,[10]全行重要岗位清单!$H$4:$I$47,2,0),\"\")","v":""}]
[{"$nulls":15},{"$f":"IF(O31=\"\",\"\",INDIRECT(ADDRESS(MATCH(O31,[10]机构!$C:$C,0),4,1,TRUE,\"机构\")))","v":""},null,null,{"$f":"IFERROR(VLOOKUP(R31,[10]全行重要岗位清单!$H$4:$I$47,2,0),\"\")","v":""}]
[{"$nulls":15},{"$f":"IF(O32=\"\",\"\",INDIRECT(ADDRESS(MATCH(O32,[10]机构!$C:$C,0),4,1,TRUE,\"机构\")))","v":""},null,null,{"$f":"IFERROR(VLOOKUP(R32,[10]全行重要岗位清单!$H$4:$I$47,2,0),\"\")","v":""}]
[{"$nulls":15},{"$f":"IF(O33=\"\",\"\",INDIRECT(ADDRESS(MATCH(O33,[10]机构!$C:$C,0),4,1,TRUE,\"机构\")))","v":""},null,null,{"$f":"IFERROR(VLOOKUP(R33,[10]全行重要岗位清单!$H$4:$I$47,2,0),\"\")","v":""}]
[{"$nulls":15},{"$f":"IF(O34=\"\",\"\",INDIRECT(ADDRESS(MATCH(O34,[10]机构!$C:$C,0),4,1,TRUE,\"机构\")))","v":""},null,null,{"$f":"IFERROR(VLOOKUP(R34,[10]全行重要岗位清单!$H$4:$I$47,2,0),\"\")","v":""}]
[{"$nulls":15},{"$f":"IF(O35=\"\",\"\",INDIRECT(ADDRESS(MATCH(O35,[10]机构!$C:$C,0),4,1,TRUE,\"机构\")))","v":""},null,null,{"$f":"IFERROR(VLOOKUP(R35,[10]全行重要岗位清单!$H$4:$I$47,2,0),\"\")","v":""}]
[{"$nulls":15},{"$f":"IF(O36=\"\",\"\",INDIRECT(ADDRESS(MATCH(O36,[10]机构!$C:$C,0),4,1,TRUE,\"机构\")))","v":""},null,null,{"$f":"IFERROR(VLOOKUP(R36,[10]全行重要岗位清单!$H$4:$I$47,2,0),\"\")","v":""}]
[{"$nulls":15},{"$f":"IF(O37=\"\",\"\",INDIRECT(ADDRESS(MATCH(O37,[10]机构!$C:$C,0),4,1,TRUE,\"机构\")))","v":""},null,null,{"$f":"IFERROR(VLOOKUP(R37,[10]全行重要岗位清单!$H$4:$I$47,2,0),\"\")","v":""}]
[{"$nulls":15},{"$f":"IF(O38=\"\",\"\",INDIRECT(ADDRESS(MATCH(O38,[10]机构!$C:$C,0),4,1,TRUE,\"机构\")))","v":""},null,null,{"$f":"IFERROR(VLOOKUP(R38,[10]全行重要岗位清单!$H$4:$I$47,2,0),\"\")","v":""}]
[{"$nulls":15},{"$f":"IF(O39=\"\",\"\",INDIRECT(ADDRESS(MATCH(O39,[10]机构!$C:$C,0),4,1,TRUE,\"机构\")))","v":""},null,null,{"$f":"IFERROR(VLOOKUP(R39,[10]全行重要岗位清单!$H$4:$I$47,2,0),\"\")","v":""}]
[{"$nulls":15},{"$f":"IF(O40=\"\",\"\",INDIRECT(ADDRESS(MATCH(O40,[10]机构!$C:$C,0),4,1,TRUE,\"机构\")))","v":""},null,null,{"$f":"IFERROR(VLOOKUP(R40,[10]全行重要岗位清单!$H$4:$I$47,2,0),\"\")","v":""}]
[{"$nulls":15},{"$f":"IF(O41=\"\",\"\",INDIRECT(ADDRESS(MATCH(O41,[10]机构!$C:$C,0),4,1,TRUE,\"机构\")))","v":""},null,null,{"$f":"IFERROR(VLOOKUP(R41,[10]全行重要岗位清单!$H$4:$I$47,2,0),\"\")","v":""}]
[{"$nulls":15},{"$f":"IF(O42=\"\",\"\",INDIRECT(ADDRESS(MATCH(O42,[10]机构!$C:$C,0),4,1,TRUE,\"机构\")))","v":""},null,null,{"$f":"IFERROR(VLOOKUP(R42,[10]全行重要岗位清单!$H$4:$I$47,2,0),\"\")","v":""}]
[{"$nulls":15},{"$f":"IF(O43=\"\",\"\",INDIRECT(ADDRESS(MATCH(O43,[10]机构!$C:$C,0),4,1,TRUE,\"机构\")))","v":""},null,null,{"$f":"IFERROR(VLOOKUP(R43,[10]全行重要岗位清单!$H$4:$I$47,2,0),\"\")","v":""}]
[{"$nulls":15},{"$f":"IF(O44=\"\",\"\",INDIRECT(ADDRESS(MATCH(O44,[10]机构!$C:$C,0),4,1,TRUE,\"机构\")))","v":""},null,null,{"$f":"IFERROR(VLOOKUP(R44,[10]全行重要岗位清单!$H$4:$I$47,2,0),\"\")","v":""}]
[{"$nulls":15},{"$f":"IF(O45=\"\",\"\",INDIRECT(ADDRESS(MATCH(O45,[10]机构!$C:$C,0),4,1,TRUE,\"机构\")))","v":""},null,null,{"$f":"IFERROR(VLOOKUP(R45,[10]全行重要岗位清单!$H$4:$I$47,2,0),\"\")","v":""}]
[{"$nulls":15},{"$f":"IF(O46=\"\",\"\",INDIRECT(ADDRESS(MATCH(O46,[10]机构!$C:$C,0),4,1,TRUE,\"机构\")))","v":""},null,null,{"$f":"IFERROR(VLOOKUP(R46,[10]全行重要岗位清单!$H$4:$I$47,2,0),\"\")","v":""}]
[{"$nulls":15},{"$f":"IF(O47=\"\",\"\",INDIRECT(ADDRESS(MATCH(O47,[10]机构!$C:$C,0),4,1,TRUE,\"机构\")))","v":""},null,null,{"$f":"IFERROR(VLOOKUP(R47,[10]全行重要岗位清单!$H$4:$I$47,2,0),\"\")","v":""}]
[{"$nulls":15},{"$f":"IF(O48=\"\",\"\",INDIRECT(ADDRESS(MATCH(O48,[10]机构!$C:$C,0),4,1,TRUE,\"机构\")))","v":""},null,null,{"$f":"IFERROR(VLOOKUP(R48,[10]全行重要岗位清单!$H$4:$I$47,2,0),\"\")","v":""}]
[{"$nulls":15},{"$f":"IF(O49=\"\",\"\",INDIRECT(ADDRESS(MATCH(O49,[10]机构!$C:$C,0),4,1,TRUE,\"机构\")))","v":""},null,null,{"$f":"IFERROR(VLOOKUP(R49,[10]全行重要岗位清单!$H$4:$I$47,2,0),\"\")","v":""}]
[{"$nulls":15},{"$f":"IF(O50=\"\",\"\",INDIRECT(ADDRESS(MATCH(O50,[10]机构!$C:$C,0),4,1,TRUE,\"机构\")))","v":""},null,null,{"$f":"IFERROR(VLOOKUP(R50,[10]全行重要岗位清单!$H$4:$I$47,2,0),\"\")","v":""}]
[{"$nulls":15},{"$f":"IF(O51=\"\",\"\",INDIRECT(ADDRESS(MATCH(O51,[10]机构!$C:$C,0),4,1,TRUE,\"机构\")))","v":""},null,null,{"$f":"IFERROR(VLOOKUP(R51,[10]全行重要岗位清单!$H$4:$I$47,2,0),\"\")","v":""}]
[{"$nulls":15},{"$f":"IF(O52=\"\",\"\",INDIRECT(ADDRESS(MATCH(O52,[10]机构!$C:$C,0),4,1,TRUE,\"机构\")))","v":""},null,null,{"$f":"IFERROR(VLOOKUP(R52,[10]全行重要岗位清单!$H$4:$I$47,2,0),\"\")","v":""}]
[{"$nulls":15},{"$f":"IF(O53=\"\",\"\",INDIRECT(ADDRESS(MATCH(O53,[10]机构!$C:$C,0),4,1,TRUE,\"机构\")))","v":""},null,null,{"$f":"IFERROR(VLOOKUP(R53,[10]全行重要岗位清单!$H$4:$I$47,2,0),\"\")","v":""}]
[{"$nulls":15},{"$f":"IF(O54=\"\",\"\",INDIRECT(ADDRESS(MATCH(O54,[10]机构!$C:$C,0),4,1,TRUE,\"机构\")))","v":""},null,null,{"$f":"IFERROR(VLOOKUP(R54,[10]全行重要岗位清单!$H$4:$I$47,2,0),\"\")","v":""}]
[{"$nulls":15},{"$f":"IF(O55=\"\",\"\",INDIRECT(ADDRESS(MATCH(O55,[10]机构!$C:$C,0),4,1,TRUE,\"机构\")))","v":""},null,null,{"$f":"IFERROR(VLOOKUP(R55,[10]全行重要岗位清单!$H$4:$I$47,2,0),\"\")","v":""}]
[{"$nulls":15},{"$f":"IF(O56=\"\",\"\",INDIRECT(ADDRESS(MATCH(O56,[10]机构!$C:$C,0),4,1,TRUE,\"机构\")))","v":""},null,null,{"$f":"IFERROR(VLOOKUP(R56,[10]全行重要岗位清单!$H$4:$I$47,2,0),\"\")","v":""}]
[{"$nulls":15},{"$f":"IF(O57=\"\",\"\",INDIRECT(ADDRESS(MATCH(O57,[10]机构!$C:$C,0),4,1,TRUE,\"机构\")))","v":""},null,null,{"$f":"IFERROR(VLOOKUP(R57,[10]全行重要岗位清单!$H$4:$I$47,2,0),\"\")","v":""}]
[{"$nulls":15},{"$f":"IF(O58=\"\",\"\",INDIRECT(ADDRESS(MATCH(O58,[10]机构!$C:$C,0),4,1,TRUE,\"机构\")))","v":""},null,null,{"$f":"IFERROR(VLOOKUP(R58,[10]全行重要岗位清单!$H$4:$I$47,2,0),\"\")","v":""}]
[{"$nulls":15},{"$f":"IF(O59=\"\",\"\",INDIRECT(ADDRESS(MATCH(O59,[10]机构!$C:$C,0),4,1,TRUE,\"机构\")))","v":""},null,null,{"$f":"IFERROR(VLOOKUP(R59,[10]全行重要岗位清单!$H$4:$I$47,2,0),\"\")","v":""}]
[{"$nulls":15},{"$f":"IF(O60=\"\",\"\",INDIRECT(ADDRESS(MATCH(O60,[10]机构!$C:$C,0),4,1,TRUE,\"机构\")))","v":""},null,null,{"$f":"IFERROR(VLOOKUP(R60,[10]全行重要岗位清单!$H$4:$I$47,2,0),\"\")","v":""}]
[{"$nulls":15},{"$f":"IF(O61=\"\",\"\",INDIRECT(ADDRESS(MATCH(O61,[10]机构!$C:$C,0),4,1,TRUE,\"机构\")))","v":""},null,null,{"$f":"IFERROR(VLOOKUP(R61,[10]全行重要岗位清单!$H$4:$I$47,2,0),\"\")","v":""}]
[{"$nulls":15},{"$f":"IF(O62=\"\",\"\",INDIRECT(ADDRESS(MATCH(O62,[10]机构!$C:$C,0),4,1,TRUE,\"机构\")))","v":""},null,null,{"$f":"IFERROR(VLOOKUP(R62,[10]全行重要岗位清单!$H$4:$I$47,2,0),\"\")","v":""}]
[{"$nulls":15},{"$f":"IF(O63=\"\",\"\",INDIRECT(ADDRESS(MATCH(O63,[10]机构!$C:$C,0),4,1,TRUE,\"机构\")))","v":""},null,null,{"$f":"IFERROR(VLOOKUP(R63,[10]全行重要岗位清单!$H$4:$I$47,2,0),\"\")","v":""}]
[{"$nulls":15},{"$f":"IF(O64=\"\",\"\",INDIRECT(ADDRESS(MATCH(O64,[10]机构!$C:$C,0),4,1,TRUE,\"机构\")))","v":""},null,null,{"$f":"IFERROR(VLOOKUP(R64,[10]全行重要岗位清单!$H$4:$I$47,2,0),\"\")","v":""}]
[{"$nulls":15},{"$f":"IF(O65=\"\",\"\",INDIRECT(ADDRESS(MATCH(O65,[10]机构!$C:$C,0),4,1,TRUE,\"机构\")))","v":""},null,null,{"$f":"IFERROR(VLOOKUP(R65,[10]全行重要岗位清单!$H$4:$I$47,2,0),\"\")","v":""}]
[{"$nulls":15},{"$f":"IF(O66=\"\",\"\",INDIRECT(ADDRESS(MATCH(O66,[10]机构!$C:$C,0),4,1,TRUE,\"机构\")))","v":""},null,null,{"$f":"IFERROR(VLOOKUP(R66,[10]全行重要岗位清单!$H$4:$I$47,2,0),\"\")","v":""}]
[{"$nulls":15},{"$f":"IF(O67=\"\",\"\",INDIRECT(ADDRESS(MATCH(O67,[10]机构!$C:$C,0),4,1,TRUE,\"机构\")))","v":""},null,null,{"$f":"IFERROR(VLOOKUP(R67,[10]全行重要岗位清单!$H$4:$I$47,2,0),\"\")","v":""}]
[{"$nulls":15},{"$f":"IF(O68=\"\",\"\",INDIRECT(ADDRESS(MATCH(O68,[10]机构!$C:$C,0),4,1,TRUE,\"机构\")))","v":""},null,null,{"$f":"IFERROR(VLOOKUP(R68,[10]全行重要岗位清单!$H$4:$I$47,2,0),\"\")","v":""}]
[{"$nulls":15},{"$f":"IF(O69=\"\",\"\",INDIRECT(ADDRESS(MATCH(O69,[10]机构!$C:$C,0),4,1,TRUE,\"机构\")))","v":""},null,null,{"$f":"IFERROR(VLOOKUP(R69,[10]全行重要岗位清单!$H$4:$I$47,2,0),\"\")","v":""}]
[{"$nulls":15},{"$f":"IF(O70=\"\",\"\",INDIRECT(ADDRESS(MATCH(O70,[10]机构!$C:$C,0),4,1,TRUE,\"机构\")))","v":""},null,null,{"$f":"IFERROR(VLOOKUP(R70,[10]全行重要岗位清单!$H$4:$I$47,2,0),\"\")","v":""}]
[{"$nulls":15},{"$f":"IF(O71=\"\",\"\",INDIRECT(ADDRESS(MATCH(O71,[10]机构!$C:$C,0),4,1,TRUE,\"机构\")))","v":""},null,null,{"$f":"IFERROR(VLOOKUP(R71,[10]全行重要岗位清单!$H$4:$I$47,2,0),\"\")","v":""}]
[{"$nulls":15},{"$f":"IF(O72=\"\",\"\",INDIRECT(ADDRESS(MATCH(O72,[10]机构!$C:$C,0),4,1,TRUE,\"机构\")))","v":""},null,null,{"$f":"IFERROR(VLOOKUP(R72,[10]全行重要岗位清单!$H$4:$I$47,2,0),\"\")","v":""}]
[{"$nulls":15},{"$f":"IF(O73=\"\",\"\",INDIRECT(ADDRESS(MATCH(O73,#REF!,0),4,1,TRUE,\"机构\")))","v":""},null,null,{"$f":"IFERROR(VLOOKUP(R73,#REF!,2,0),\"\")","v":""}]
[{"$nulls":15},{"$f":"IF(O74=\"\",\"\",INDIRECT(ADDRESS(MATCH(O74,#REF!,0),4,1,TRUE,\"机构\")))","v":""},null,null,{"$f":"IFERROR(VLOOKUP(R74,#REF!,2,0),\"\")","v":""}]
[{"$nulls":15},{"$f":"IF(O75=\"\",\"\",INDIRECT(ADDRESS(MATCH(O75,#REF!,0),4,1,TRUE,\"机构\")))","v":""},null,null,{"$f":"IFERROR(VLOOKUP(R75,#REF!,2,0),\"\")","v":""}]
[{"$nulls":15},{"$f":"IF(O76=\"\",\"\",INDIRECT(ADDRESS(MATCH(O76,#REF!,0),4,1,TRUE,\"机构\")))","v":""},null,null,{"$f":"IFERROR(VLOOKUP(R76,#REF!,2,0),\"\")","v":""}]
[{"$nulls":15},{"$f":"IF(O77=\"\",\"\",INDIRECT(ADDRESS(MATCH(O77,#REF!,0),4,1,TRUE,\"机构\")))","v":""},null,null,{"$f":"IFERROR(VLOOKUP(R77,#REF!,2,0),\"\")","v":""}]
[{"$nulls":15},{"$f":"IF(O78=\"\",\"\",INDIRECT(ADDRESS(MATCH(O78,#REF!,0),4,1,TRUE,\"机构\")))","v":""},null,null,{"$f":"IFERROR(VLOOKUP(R78,#REF!,2,0),\"\")","v":""}]
[{"$nulls":15},{"$f":"IF(O79=\"\",\"\",INDIRECT(ADDRESS(MATCH(O79,#REF!,0),4,1,TRUE,\"机构\")))","v":""},null,null,{"$f":"IFERROR(VLOOKUP(R79,#REF!,2,0),\"\")","v":""}]
[{"$nulls":15},{"$f":"IF(O80=\"\",\"\",INDIRECT(ADDRESS(MATCH(O80,#REF!,0),4,1,TRUE,\"机构\")))","v":""},null,null,{"$f":"IFERROR(VLOOKUP(R80,#REF!,2,0),\"\")","v":""}]
[{"$nulls":15},{"$f":"IF(O81=\"\",\"\",INDIRECT(ADDRESS(MATCH(O81,#REF!,0),4,1,TRUE,\"机构\")))","v":""},null,null,{"$f":"IFERROR(VLOOKUP(R81,#REF!,2,0),\"\")","v":""}]
[{"$nulls":15},{"$f":"IF(O82=\"\",\"\",INDIRECT(ADDRESS(MATCH(O82,#REF!,0),4,1,TRUE,\"机构\")))","v":""},null,null,{"$f":"IFERROR(VLOOKUP(R82,#REF!,2,0),\"\")","v":""}]
[{"$nulls":15},{"$f":"IF(O83=\"\",\"\",INDIRECT(ADDRESS(MATCH(O83,#REF!,0),4,1,TRUE,\"机构\")))","v":""},null,null,{"$f":"IFERROR(VLOOKUP(R83,#REF!,2,0),\"\")","v":""}]
[{"$nulls":15},{"$f":"IF(O84=\"\",\"\",INDIRECT(ADDRESS(MATCH(O84,#REF!,0),4,1,TRUE,\"机构\")))","v":""},null,null,{"$f":"IFERROR(VLOOKUP(R84,#REF!,2,0),\"\")","v":""}]
[{"$nulls":15},{"$f":"IF(O85=\"\",\"\",INDIRECT(ADDRESS(MATCH(O85,#REF!,0),4,1,TRUE,\"机构\")))","v":""},null,null,{"$f":"IFERROR(VLOOKUP(R85,#REF!,2,0),\"\")","v":""}]
[{"$nulls":15},{"$f":"IF(O86=\"\",\"\",INDIRECT(ADDRESS(MATCH(O86,#REF!,0),4,1,TRUE,\"机构\")))","v":""},null,null,{"$f":"IFERROR(VLOOKUP(R86,#REF!,2,0),\"\")","v":""}]
[{"$nulls":15},{"$f":"IF(O87=\"\",\"\",INDIRECT(ADDRESS(MATCH(O87,#REF!,0),4,1,TRUE,\"机构\")))","v":""},null,null,{"$f":"IFERROR(VLOOKUP(R87,#REF!,2,0),\"\")","v":""}]
[{"$nulls":15},{"$f":"IF(O88=\"\",\"\",INDIRECT(ADDRESS(MATCH(O88,#REF!,0),4,1,TRUE,\"机构\")))","v":""},null,null,{"$f":"IFERROR(VLOOKUP(R88,#REF!,2,0),\"\")","v":""}]
[{"$nulls":15},{"$f":"IF(O89=\"\",\"\",INDIRECT(ADDRESS(MATCH(O89,#REF!,0),4,1,TRUE,\"机构\")))","v":""},null,null,{"$f":"IFERROR(VLOOKUP(R89,#REF!,2,0),\"\")","v":""}]
[{"$nulls":15},{"$f":"IF(O90=\"\",\"\",INDIRECT(ADDRESS(MATCH(O90,#REF!,0),4,1,TRUE,\"机构\")))","v":""},null,null,{"$f":"IFERROR(VLOOKUP(R90,#REF!,2,0),\"\")","v":""}]
[{"$nulls":15},{"$f":"IF(O91=\"\",\"\",INDIRECT(ADDRESS(MATCH(O91,#REF!,0),4,1,TRUE,\"机构\")))","v":""},null,null,{"$f":"IFERROR(VLOOKUP(R91,#REF!,2,0),\"\")","v":""}]
[{"$nulls":15},{"$f":"IF(O92=\"\",\"\",INDIRECT(ADDRESS(MATCH(O92,#REF!,0),4,1,TRUE,\"机构\")))","v":""},null,null,{"$f":"IFERROR(VLOOKUP(R92,#REF!,2,0),\"\")","v":""}]
[{"$nulls":15},{"$f":"IF(O93=\"\",\"\",INDIRECT(ADDRESS(MATCH(O93,#REF!,0),4,1,TRUE,\"机构\")))","v":""},null,null,{"$f":"IFERROR(VLOOKUP(R93,#REF!,2,0),\"\")","v":""}]
[{"$nulls":15},{"$f":"IF(O94=\"\",\"\",INDIRECT(ADDRESS(MATCH(O94,#REF!,0),4,1,TRUE,\"机构\")))","v":""},null,null,{"$f":"IFERROR(VLOOKUP(R94,#REF!,2,0),\"\")","v":""}]
[{"$nulls":15},{"$f":"IF(O95=\"\",\"\",INDIRECT(ADDRESS(MATCH(O95,#REF!,0),4,1,TRUE,\"机构\")))","v":""},null,null,{"$f":"IFERROR(VLOOKUP(R95,#REF!,2,0),\"\")","v":""}]
[{"$nulls":15},{"$f":"IF(O96=\"\",\"\",INDIRECT(ADDRESS(MATCH(O96,#REF!,0),4,1,TRUE,\"机构\")))","v":""},null,null,{"$f":"IFERROR(VLOOKUP(R96,#REF!,2,0),\"\")","v":""}]
[{"$nulls":15},{"$f":"IF(O97=\"\",\"\",INDIRECT(ADDRESS(MATCH(O97,#REF!,0),4,1,TRUE,\"机构\")))","v":""},null,null,{"$f":"IFERROR(VLOOKUP(R97,#REF!,2,0),\"\")","v":""}]
[{"$nulls":15},{"$f":"IF(O98=\"\",\"\",INDIRECT(ADDRESS(MATCH(O98,#REF!,0),4,1,TRUE,\"机构\")))","v":""},null,null,{"$f":"IFERROR(VLOOKUP(R98,#REF!,2,0),\"\")","v":""}]
[{"$nulls":15},{"$f":"IF(O99=\"\",\"\",INDIRECT(ADDRESS(MATCH(O99,#REF!,0),4,1,TRUE,\"机构\")))","v":""},null,null,{"$f":"IFERROR(VLOOKUP(R99,#REF!,2,0),\"\")","v":""}]
[{"$nulls":15},{"$f":"IF(O100=\"\",\"\",INDIRECT(ADDRESS(MATCH(O100,#REF!,0),4,1,TRUE,\"机构\")))","v":""},null,null,{"$f":"IFERROR(VLOOKUP(R100,#REF!,2,0),\"\")","v":""}]
[{"$nulls":15},{"$f":"IF(O101=\"\",\"\",INDIRECT(ADDRESS(MATCH(O101,#REF!,0),4,1,TRUE,\"机构\")))","v":""},null,null,{"$f":"IFERROR(VLOOKUP(R101,#REF!,2,0),\"\")","v":""}]
[{"$nulls":15},{"$f":"IF(O102=\"\",\"\",INDIRECT(ADDRESS(MATCH(O102,#REF!,0),4,1,TRUE,\"机构\")))","v":""},null,null,{"$f":"IFERROR(VLOOKUP(R102,#REF!,2,0),\"\")","v":""}]
[{"$nulls":15},{"$f":"IF(O103=\"\",\"\",INDIRECT(ADDRESS(MATCH(O103,#REF!,0),4,1,TRUE,\"机构\")))","v":""},null,null,{"$f":"IFERROR(VLOOKUP(R103,#REF!,2,0),\"\")","v":""}]
[{"$nulls":15},{"$f":"IF(O104=\"\",\"\",INDIRECT(ADDRESS(MATCH(O104,#REF!,0),4,1,TRUE,\"机构\")))","v":""},null,null,{"$f":"IFERROR(VLOOKUP(R104,#REF!,2,0),\"\")","v":""}]
[{"$nulls":15},{"$f":"IF(O105=\"\",\"\",INDIRECT(ADDRESS(MATCH(O105,#REF!,0),4,1,TRUE,\"机构\")))","v":""},null,null,{"$f":"IFERROR(VLOOKUP(R105,#REF!,2,0),\"\")","v":""}]
[{"$nulls":15},{"$f":"IF(O106=\"\",\"\",INDIRECT(ADDRESS(MATCH(O106,#REF!,0),4,1,TRUE,\"机构\")))","v":""},null,null,{"$f":"IFERROR(VLOOKUP(R106,#REF!,2,0),\"\")","v":""}]
[{"$nulls":15},{"$f":"IF(O107=\"\",\"\",INDIRECT(ADDRESS(MATCH(O107,#REF!,0),4,1,TRUE,\"机构\")))","v":""},null,null,{"$f":"IFERROR(VLOOKUP(R107,#REF!,2,0),\"\")","v":""}]
[{"$nulls":15},{"$f":"IF(O108=\"\",\"\",INDIRECT(ADDRESS(MATCH(O108,#REF!,0),4,1,TRUE,\"机构\")))","v":""},null,null,{"$f":"IFERROR(VLOOKUP(R108,#REF!,2,0),\"\")","v":""}]
[{"$nulls":15},{"$f":"IF(O109=\"\",\"\",INDIRECT(ADDRESS(MATCH(O109,#REF!,0),4,1,TRUE,\"机构\")))","v":""},null,null,{"$f":"IFERROR(VLOOKUP(R109,#REF!,2,0),\"\")","v":""}]
[{"$nulls":15},{"$f":"IF(O110=\"\",\"\",INDIRECT(ADDRESS(MATCH(O110,#REF!,0),4,1,TRUE,\"机构\")))","v":""},null,null,{"$f":"IFERROR(VLOOKUP(R110,#REF!,2,0),\"\")","v":""}]
[{"$nulls":15},{"$f":"IF(O111=\"\",\"\",INDIRECT(ADDRESS(MATCH(O111,#REF!,0),4,1,TRUE,\"机构\")))","v":""},null,null,{"$f":"IFERROR(VLOOKUP(R111,#REF!,2,0),\"\")","v":""}]
[{"$nulls":15},{"$f":"IF(O112=\"\",\"\",INDIRECT(ADDRESS(MATCH(O112,#REF!,0),4,1,TRUE,\"机构\")))","v":""},null,null,{"$f":"IFERROR(VLOOKUP(R112,#REF!,2,0),\"\")","v":""}]
[{"$nulls":15},{"$f":"IF(O113=\"\",\"\",INDIRECT(ADDRESS(MATCH(O113,#REF!,0),4,1,TRUE,\"机构\")))","v":""},null,null,{"$f":"IFERROR(VLOOKUP(R113,#REF!,2,0),\"\")","v":""}]
[{"$nulls":15},{"$f":"IF(O114=\"\",\"\",INDIRECT(ADDRESS(MATCH(O114,#REF!,0),4,1,TRUE,\"机构\")))","v":""},null,null,{"$f":"IFERROR(VLOOKUP(R114,#REF!,2,0),\"\")","v":""}]
[{"$nulls":15},{"$f":"IF(O115=\"\",\"\",INDIRECT(ADDRESS(MATCH(O115,#REF!,0),4,1,TRUE,\"机构\")))","v":""},null,null,{"$f":"IFERROR(VLOOKUP(R115,#REF!,2,0),\"\")","v":""}]
[{"$nulls":15},{"$f":"IF(O116=\"\",\"\",INDIRECT(ADDRESS(MATCH(O116,#REF!,0),4,1,TRUE,\"机构\")))","v":""},null,null,{"$f":"IFERROR(VLOOKUP(R116,#REF!,2,0),\"\")","v":""}]
[{"$nulls":15},{"$f":"IF(O117=\"\",\"\",INDIRECT(ADDRESS(MATCH(O117,#REF!,0),4,1,TRUE,\"机构\")))","v":""},null,null,{"$f":"IFERROR(VLOOKUP(R117,#REF!,2,0),\"\")","v":""}]
[{"$nulls":15},{"$f":"IF(O118=\"\",\"\",INDIRECT(ADDRESS(MATCH(O118,#REF!,0),4,1,TRUE,\"机构\")))","v":""},null,null,{"$f":"IFERROR(VLOOKUP(R118,#REF!,2,0),\"\")","v":""}]
[{"$nulls":15},{"$f":"IF(O119=\"\",\"\",INDIRECT(ADDRESS(MATCH(O119,#REF!,0),4,1,TRUE,\"机构\")))","v":""},null,null,{"$f":"IFERROR(VLOOKUP(R119,#REF!,2,0),\"\")","v":""}]
[{"$nulls":15},{"$f":"IF(O120=\"\",\"\",INDIRECT(ADDRESS(MATCH(O120,#REF!,0),4,1,TRUE,\"机构\")))","v":""},null,null,{"$f":"IFERROR(VLOOKUP(R120,#REF!,2,0),\"\")","v":""}]
{"$rows_left_out":112}
{"sheet":"Sheet2","index":1,"n_rows":43,"n_cols":12,"rows_kept":43,"cut":false,"hidden":true,"merged":[]}
["1.总行部门、直属机构","行政印章专管员","办公室","1.跨机构（部门）调整岗位；","离任审计","离岗检查",null,"安徽",null,"综合组-013号",null,"综合组-023号"]
["2.分行各级管理机构本部","总行相关部门正职","财务管理部","2.在机构（部门）内部调整岗位；","离岗检查","代职检查",null,"北京",null,"综合组-014号",null,"综合组-024号"]
["3.基层营业网点（含营业部）","总行相关部门副职","个人数字金融部","3.岗位主要工作事项或者主要工作对象调整；","未开展","未开展",null,"大连",null,"综合组-022号",null,"综合组-025号"]
[null,"一级分行、直属分行正职","公司金融部","4.非经营管理岗位的，安排从事一段时间本岗位以外的工作事项。",null,null,null,"福建",null,"综合组-027号"]
[null,"一级分行、直属分行副职（不含纪委书记）","集中采购中心","其他（请在备注中说明）",null,null,null,"甘肃"]
[null,"一级分行、直属分行纪委书记","交易银行部",{"$nulls":4},"广东"]
[null,"一级分行、直属分行相关部门正职","渠道与运营管理部",{"$nulls":4},"广西"]
[null,"一级分行、直属分行相关部门副职","全球市场部",{"$nulls":4},"贵州"]
[null,"二级分行、管辖支行正职","人力资源部",{"$nulls":4},"海南"]
[null,"二级分行、管辖支行副职（不含纪委书记）","消费金融部",{"$nulls":4},"河北"]
[null,"二级分行、管辖支行纪委书记","信息科技部",{"$nulls":4},"河南"]
[null,"二级分行、各级管辖支行相关部门正职","信息科技运营中心",{"$nulls":4},"黑龙江"]
[null,"二级分行、各级管辖支行相关部门副职","信用审批部",{"$nulls":4},"湖北"]
[null,"基层营业网点正职","银行卡中心",{"$nulls":4},"湖南"]
[null,"基层营业网点副职（不含运营内控副行长）",{"$nulls":5},"吉林"]
[null,"对公客户经理",{"$nulls":5},"江苏"]
[null,"票据业务主管、高级经理",{"$nulls":5},"江西"]
[null,"票据业务交易员",{"$nulls":5},"辽宁"]
[null,"国际结算、贸易融资及保函授信\n业务操作岗位",{"$nulls":5},"内蒙古"]
[null,"国际结算、贸易融资及保函授信\n业务专用章、合同章管理员",{"$nulls":5},"宁波"]
[null,"对私客户经理\n（个贷）",{"$nulls":5},"宁夏"]
[null,"业务经理\n（个贷核准）",{"$nulls":5},"青岛"]
[null,"理财经理",{"$nulls":5},"青海"]
[null,"资深交易员",{"$nulls":5},"山东"]
[null,"主管级高级交易员\n（衍生产品交易）",{"$nulls":5},"山西"]
[null,"高级交易员\n（衍生产品交易）",{"$nulls":5},"陕西"]
[null,"金融市场部门高级经理",{"$nulls":5},"上海"]
[null,"主任级交易员\n（衍生产品交易）",{"$nulls":5},"深圳"]
[null,"交易员\n（衍生产品交易）",{"$nulls":5},"四川"]
[null,"运营内控副行长/经理",{"$nulls":5},"苏州"]
[null,"临柜经办柜员",{"$nulls":5},"天津"]
[null,"金库管库员",{"$nulls":5},"西藏"]
[null,"重要空白凭证库房管理员",{"$nulls":5},"厦门"]
[null,"信息科技数据库管理岗位",{"$nulls":5},"新疆"]
[null,"信息科技敏感信息管理岗位\n（ID管理、账号管理、访问控制）",{"$nulls":5},"云南"]
[null,"访问控制管理员\n（信息系统用户管理）",{"$nulls":5},"浙江"]
[null,"秘钥管理员\n（生产秘钥管理）",{"$nulls":5},"重庆"]
[null,"数据磁带管理员\n（生产数据磁带管理）"]
[null,"设备库房管理员\n（设备库房管理）"]
[null,"境内专职公司专业审批人"]
[null,"消费金融客户经理\n（卡分期）"]
[null,"财务专用章专管员"]
[null,"采购业务项目经理"]